{"text_format":"3","workbook":"xlsx","n_sheets":7,"sheets":["Basic Details","Result AAP","Result KeyFactorwise AAP","Input","Result KeyFactorwise","Result","Scoring Rules"],"not_rendered":{"macros":1,"defined_names":12},"read":"whole","date_system":"1900"}

{"sheet":"Basic Details","index":0,"n_rows":51,"n_cols":20,"rows_kept":51,"merged":[[0,0,0,8],[1,0,1,8],[2,0,2,8],[3,0,3,8],[5,0,5,8],[6,0,6,8],[7,0,7,8],[8,3,8,8],[9,3,9,8],[10,3,10,8],[11,3,11,8],[12,3,12,8],[13,3,13,8],[14,3,14,8],[15,3,15,8],[16,3,16,8],[17,3,17,8],[18,3,18,8],[19,0,20,0],[19,1,20,1],[19,3,19,4],[19,5,19,6],[19,7,19,8],[21,3,21,8],[22,3,22,8],[23,3,23,8],[24,3,24,8],[25,3,25,8],[26,0,29,0],[26,3,26,8],[27,3,27,8],[28,3,28,8],[29,3,29,8],[30,3,30,8],[31,0,31,4],[34,0,34,8],[36,3,36,8],[37,6,38,8],[39,3,39,8],[40,3,40,8],[41,3,41,8],[42,3,42,8],[43,3,43,8],[44,3,44,8],[45,3,45,8],[46,3,46,8],[47,3,47,8],[48,3,48,8],[49,3,49,8],[50,3,50,8]]}
["Government of Rajasthan",{"$nulls":8},"Version : 20220316",{"$nulls":6},"2019-20","1-July-2018 to 30-June-2019","1-April-2018 to 31-March-2019",2019]
["Department of College Education, Rajasthan"]
["Assessment Matrix for Annual Auditing Programme 2021-22"]
["(An initiative in compliance of the Budget Announcement February 2019, Point No 32)"]
[]
["Format-B"]
{"$rows_left_out":46}
{"sheet":"Result AAP","index":1,"n_rows":21,"n_cols":30,"rows_kept":21,"merged":[[0,1,0,9],[1,1,1,9],[2,1,2,9],[3,7,3,9],[12,1,12,2],[14,1,14,3],[15,1,15,3],[16,1,16,3],[17,1,17,6],[18,1,18,3],[18,5,18,6]]}
[null,{"$f":"CONCATENATE(UPPER('Basic Details'!D9),\" \",'Basic Details'!D10)","v":" "},{"$nulls":19},0,"D",{"$nulls":4},"Range of institutional CGPA","Letter Grade","Performance Descriptor"]
[null,{"$f":"CONCATENATE(\"Assessment Matrix for Annual Auditing Programe : \",'Basic Details'!D30,\" Report\")","v":"Assessment Matrix for Annual Auditing Programe : 2021 Report"},{"$nulls":19},1.5,"D",{"$nulls":4},"3.51 – 4.00","A++","Accredited"]
[null,{"$f":"CONCATENATE(\"Inspection Phase : \",'Basic Details'!D37,\"(\",'Basic Details'!D31,\") for Session : \",'Basic Details'!X1,\" and Inspection Dates : \",'Basic Details'!D38,\"-\",'Basic Details'!H38,\"-\",'Basic Details'!I38,\" and \",'Basic Details'!D39,\"-\",'Basic Details'!H39,\"-\",'Basic Details'!I39)","v":"Inspection Phase : (Draft) for Session :  and Inspection Dates : -- and --"},{"$nulls":19},1.5001,"C",{"$nulls":4},"3.26 – 3.50","A+","Accredited"]
[null,"Performance Criteria","Weights","Criteria-wise Grade Points","Maximum Weighted Credits","Criteria-wise Grade Points Averages","Crietria-wise Grade","Supporting Document Seq. Number",{"$nulls":5},"Delete Input Values",{"$nulls":7},2,"C",{"$nulls":4},"3.01 – 3.25","A","Accredited"]
[null,{"$f":"+Input!A7","v":"A. Teaching and Learning"},{"$f":"SUM('Result KeyFactorwise AAP'!C5:C9)","v":31.25},{"$f":"SUM('Result KeyFactorwise AAP'!D5:D9)","v":{"v":0,"d":"0.00"}},{"$f":"SUM('Result KeyFactorwise AAP'!E5:E9)","v":{"v":125,"d":"125.00"}},{"$f":"IF(C5=\"\",\"\",ROUND(D5/C5,3))","v":{"v":0,"d":"0.0000"}},{"$f":"IF(F5=0,\"D\",VLOOKUP(F5,$V$1:$W$21,2))","v":"D"},{"$f":"+'Result KeyFactorwise AAP'!I5","v":{"v":0,"d":"0000"}},"-",{"$f":"+'Result KeyFactorwise AAP'!K9","v":{"v":0,"d":"0000"}},{"$nulls":3},"A",{"$nulls":7},2.001,"B",{"$nulls":4},"2.76 – 3.00","B++","Accredited"]
[null,{"$f":"+Input!A49","v":"B. Research and Professional Practices"},{"$f":"SUM('Result KeyFactorwise AAP'!C10:C11)","v":{"v":18.5,"d":"18.50"}},{"$f":"SUM('Result KeyFactorwise AAP'!D10:D11)","v":{"v":0,"d":"0.00"}},{"$f":"SUM('Result KeyFactorwise AAP'!E10:E11)","v":{"v":74,"d":"74.00"}},{"$f":"IF(C6=\"\",\"\",ROUND(D6/C6,3))","v":{"v":0,"d":"0.0000"}},"D",{"$f":"+'Result KeyFactorwise AAP'!I10","v":{"v":0,"d":"0000"}},"-",{"$f":"+'Result KeyFactorwise AAP'!K11","v":{"v":0,"d":"0000"}},{"$nulls":3},"B",{"$nulls":7},2.5,"B",{"$nulls":4},"2.51 – 2.75","B+","Accredited"]
{"$rows_left_out":16}
{"sheet":"Result KeyFactorwise AAP","index":2,"n_rows":30,"n_cols":22,"rows_kept":30,"merged":[[0,0,0,10],[1,0,1,10],[2,0,2,10],[3,8,3,10],[4,0,8,0],[9,0,10,0],[11,0,12,0],[13,0,14,0],[15,0,16,0],[17,0,21,0],[25,0,25,2],[26,0,26,2],[27,0,27,2],[28,0,28,3],[29,0,29,3]]}
[{"$f":"+Result!B1","v":" "},{"$nulls":19},0,"D"]
[{"$f":"+'Result AAP'!B2","v":"Assessment Matrix for Annual Auditing Programe : 2021 Report"},{"$nulls":19},1.5,"D"]
[{"$f":"+'Result AAP'!B3","v":"Inspection Phase : (Draft) for Session :  and Inspection Dates : -- and --"},{"$nulls":19},1.5001,"C"]
["Crteria","Key Factors Criteria","Weights","Criteria-wise Grade Points","Maximum Weighted Credits","Criteria-wise Grade Points Averages","Crietria-wise Grade","Delete Input Values Key Factor ","Supporting Document Seq. Number",{"$nulls":11},2,"C"]
["A. Teaching  and  Learning","A-1 Student Strength",{"$f":"SUMIF(Input!$BM$7:$BM$187,O5,Input!$J$7:$J$187)","v":{"v":3.5,"d":"3.50"}},{"$f":"SUMIF(Input!$BM$7:$BM$187,O5,Input!$K$7:$K$187)","v":{"v":0,"d":"0.00"}},{"$f":"SUMIF(Input!$BM$7:$BM$187,O5,Input!$BQ$7:$BQ$187)","v":{"v":14,"d":"14.00"}},{"$f":"IF(C5=\"\",\"\",ROUND(D5/C5,3))","v":{"v":0,"d":"0.0000"}},{"$f":"IF(F5=0,\"D\",VLOOKUP(F5,$U$1:$V$16,2))","v":"D"},null,{"$f":"+Input!AB7","v":{"v":0,"d":"0000"}},"-",{"$f":"+Input!AD8","v":{"v":0,"d":"0000"}},{"$nulls":3},"A-1",{"$nulls":5},2.001,"B"]
[null,"A-2 Inclusivity",{"$f":"SUMIF(Input!$BM$7:$BM$187,O6,Input!$J$7:$J$187)","v":3.25},{"$f":"SUMIF(Input!$BM$7:$BM$187,O6,Input!$K$7:$K$187)","v":{"v":0,"d":"0.00"}},{"$f":"SUMIF(Input!$BM$7:$BM$187,O6,Input!$BQ$7:$BQ$187)","v":{"v":13,"d":"13.00"}},{"$f":"IF(C6=\"\",\"\",ROUND(D6/C6,3))","v":{"v":0,"d":"0.0000"}},"D",null,{"$f":"+Input!AB9","v":{"v":0,"d":"0000"}},"-",{"$f":"+Input!AD19","v":{"v":0,"d":"0000"}},{"$nulls":3},"A-2",{"$nulls":5},2.5,"B"]
{"$rows_left_out":25}
{"sheet":"Input","index":3,"n_rows":193,"n_cols":78,"rows_kept":193,"merged":[[0,0,0,29],[0,30,0,33],[0,34,1,34],[0,35,3,35],[0,55,3,59],[1,0,1,29],[1,30,1,33],[2,0,2,29],[2,30,3,33],[2,34,3,34],[3,0,3,29],[4,0,5,0],[4,1,5,1],[4,2,5,2],[4,3,5,3],[4,4,5,4],[4,5,5,6],[4,7,5,7],[4,8,5,8],[4,9,5,9],[4,10,5,10],[4,11,5,11],[4,12,5,12],[4,13,5,13],[4,14,5,14],[4,15,5,15],[4,16,4,25],[4,27,5,29],[4,30,5,30],[4,31,5,31],[4,32,5,32],[4,33,5,52],[4,53,5,53],[4,55,4,59],[5,16,5,17],[5,18,5,19],[5,20,5,21],[5,22,5,23],[5,24,5,25],[6,0,16,0],[6,1,7,1],[6,33,6,52],[7,33,7,52],[8,1,16,1],[8,2,9,2],[8,3,9,3],[8,9,9,9],[8,33,8,52],[9,5,9,6],[9,33,9,52],[10,33,10,52],[11,33,11,52],[12,33,12,52],[13,33,13,52],[14,33,14,52],[15,33,15,52],[16,33,16,52],[17,0,25,0],[17,1,18,1],[17,33,17,52],[18,33,18,52],[19,1,25,1],[19,5,19,6],[19,33,19,52],[20,5,20,6],[20,33,20,52],[21,5,21,6],[21,33,21,52],[22,5,22,6],[22,33,22,52],[23,33,23,52],[24,33,24,52],[25,5,25,6],[25,33,25,51],[26,0,34,0],[26,1,32,1],[26,5,26,6],[26,33,26,51],[27,33,27,51],[28,33,28,51],[29,33,29,51],[30,5,30,6],[30,33,30,51],[31,5,31,6],[31,33,31,51],[32,5,32,6],[32,33,32,51],[33,1,34,1],[33,33,33,52],[34,33,34,52],[35,0,43,0],[35,1,43,1],[35,33,35,52],[36,33,36,52],[37,33,37,52],[38,33,38,52],[39,33,39,52],[40,33,40,52],[41,33,41,52],[42,33,42,51],[43,33,43,51],[44,0,47,0],[44,1,47,1],[44,33,44,52],[45,33,45,52],[46,33,46,52],[47,5,47,6],[47,33,47,52],[48,0,51,0],[48,1,51,1],[48,33,48,52],[49,33,49,52],[50,33,50,52],[51,33,51,52],[52,0,56,0],[52,1,56,1],[52,33,52,52],[53,33,53,52],[54,5,54,6],[54,33,54,52],[55,5,55,6],[55,33,55,52],[56,5,56,6],[56,33,56,52],[57,0,63,0],[57,33,57,52],[58,5,58,6],[58,33,58,52],[59,1,63,1],[59,33,59,52],[60,33,60,52],[61,5,61,6],[61,33,61,52],[62,5,62,6],[62,33,62,51],[63,5,63,6],[63,33,63,51],[64,0,73,0],[64,1,73,1],[64,5,64,6],[64,33,64,52],[65,33,65,52],[66,33,66,52],[67,33,67,52],[68,33,68,52],[69,33,69,52],[70,33,70,52],[71,33,71,52],[72,5,72,6],[72,33,72,52],[73,5,73,6],[73,33,73,52],[74,0,83,0],[74,1,83,1],[74,5,74,6],[74,33,74,52],[75,5,75,6],[75,33,75,52],[76,33,76,52],[77,5,77,6],[77,33,77,52],[78,33,78,52],[79,5,79,6],[79,33,79,52],[80,5,80,6],[80,33,80,52],[81,5,81,6],[81,33,81,52],[82,5,82,6],[82,33,82,52],[83,5,83,6],[83,33,83,52],[84,0,92,0],[84,1,88,1],[84,33,84,52],[85,5,85,6],[85,33,85,52],[86,5,86,6],[86,33,86,52],[87,5,87,6],[87,33,87,52],[88,5,88,6],[88,33,88,52],[89,1,92,1],[89,33,89,52],[90,33,90,52],[91,5,91,6],[91,33,91,52],[92,5,92,6],[92,33,92,52],[93,0,103,0],[93,1,103,1],[93,5,93,6],[93,33,93,52],[94,5,94,6],[94,33,94,52],[95,5,95,6],[95,33,95,52],[96,33,96,52],[97,33,97,52],[98,5,98,6],[98,33,98,52],[99,33,99,52],[100,5,100,6],[100,33,100,52],[101,5,101,6],[101,33,101,52],[102,33,102,52],[103,5,103,6],[103,33,103,52],[104,0,112,0],[104,1,112,1],[104,33,104,52],[105,5,105,6],[105,33,105,52],[106,5,106,6],[106,33,106,52],[107,5,107,6],[107,33,107,52],[108,5,108,6],[108,33,108,52],[109,5,109,6],[109,33,109,52],[110,5,110,6],[110,33,110,52],[111,5,111,6],[111,33,111,52],[112,5,112,6],[112,33,112,52],[113,0,121,0],[113,1,121,1],[113,5,113,6],[113,33,113,52],[114,5,114,6],[114,33,114,52],[115,5,115,6],[115,33,115,52],[116,5,116,6],[116,33,116,52],[117,5,117,6],[117,33,117,52],[118,5,118,6],[118,33,118,52],[119,5,119,6],[119,33,119,52],[120,5,120,6],[120,33,120,52],[121,5,121,6],[121,33,121,52],[122,0,131,0],[122,1,131,1],[122,5,122,6],[122,33,122,52],[123,5,123,6],[123,33,123,52],[124,5,124,6],[124,33,124,52],[125,5,125,6],[125,33,125,52],[126,5,126,6],[126,33,126,52],[127,5,127,6],[127,33,127,52],[128,5,128,6],[128,33,128,52],[129,5,129,6],[129,33,129,52],[130,5,130,6],[130,33,130,52],[131,5,131,6],[131,33,131,52],[132,0,140,0],[132,1,135,1],[132,33,132,52],[133,33,133,52],[134,33,134,52],[135,5,135,6],[135,33,135,52],[136,1,140,1],[136,5,136,6],[136,33,136,52],[137,5,137,6],[137,33,137,52],[138,5,138,6],[138,33,138,52],[139,5,139,6],[139,33,139,52],[140,5,140,6],[140,33,140,52],[141,0,148,0],[141,1,144,1],[141,5,141,6],[141,33,141,52],[142,5,142,6],[142,33,142,52],[143,5,143,6],[143,33,143,52],[144,5,144,6],[144,33,144,51],[145,1,148,1],[145,5,145,6],[145,33,145,52],[146,5,146,6],[146,33,146,52],[147,5,147,6],[147,33,147,52],[148,5,148,6],[148,33,148,52],[149,0,155,0],[149,1,151,1],[149,5,149,6],[149,33,149,52],[150,5,150,6],[150,33,150,52],[151,33,151,52],[152,1,155,1],[152,5,152,6],[152,33,152,52],[153,5,153,6],[153,33,153,52],[154,33,154,52],[155,5,155,6],[155,33,155,52],[156,0,164,0],[156,5,156,6],[156,33,156,52],[157,1,163,1],[157,5,157,6],[157,33,157,52],[158,5,158,6],[158,33,158,52],[159,5,159,6],[159,33,159,52],[160,5,160,6],[160,33,160,52],[161,5,161,6],[161,33,161,52],[162,5,162,6],[162,33,162,52],[163,5,163,6],[163,33,163,52],[164,5,164,6],[164,33,164,52],[165,0,171,0],[165,1,171,1],[165,2,166,2],[165,3,166,3],[165,5,166,6],[165,7,166,7],[165,8,166,8],[165,9,166,9],[165,10,166,10],[165,11,166,11],[165,12,166,12],[165,13,166,13],[165,14,166,14],[165,15,166,15],[165,16,166,16],[165,17,166,17],[165,18,166,18],[165,19,166,19],[165,20,166,20],[165,21,166,21],[165,22,166,22],[165,23,166,23],[165,24,166,24],[165,25,166,25],[165,26,166,26],[165,27,166,27],[165,28,166,28],[165,29,166,29],[165,30,166,30],[165,31,166,31],[165,32,166,32],[165,33,166,52],[165,53,166,53],[165,55,166,55],[165,56,166,56],[165,57,166,57],[165,58,166,58],[165,59,166,59],[165,64,166,64],[165,66,166,66],[165,67,166,67],[165,68,166,68],[165,69,166,69],[167,2,168,2],[167,3,168,3],[167,5,168,6],[167,7,168,7],[167,8,168,8],[167,9,168,9],[167,10,168,10],[167,11,168,11],[167,12,168,12],[167,13,168,13],[167,14,168,14],[167,15,168,15],[167,16,168,16],[167,17,168,17],[167,18,168,18],[167,19,168,19],[167,20,168,20],[167,21,168,21],[167,22,168,22],[167,23,168,23],[167,24,168,24],[167,25,168,25],[167,26,168,26],[167,27,168,27],[167,28,168,28],[167,29,168,29],[167,30,168,30],[167,31,168,31],[167,32,168,32],[167,33,168,52],[167,53,168,53],[167,55,168,55],[167,56,168,56],[167,57,168,57],[167,58,168,58],[167,59,168,59],[167,64,168,64],[167,66,168,66],[167,67,168,67],[167,68,168,68],[167,69,168,69],[169,5,169,6],[169,33,169,52],[170,5,170,6],[170,33,170,52],[171,5,171,6],[171,33,171,52],[172,0,181,0],[172,1,181,1],[172,5,172,6],[172,33,172,52],[173,33,173,52],[174,5,174,6],[174,33,174,52],[175,5,175,6],[175,33,175,52],[176,5,176,6],[176,33,176,52],[177,33,177,52],[178,5,178,6],[178,33,178,52],[179,33,179,52],[180,5,180,6],[180,33,180,52],[181,5,181,6],[181,33,181,52],[182,0,186,0],[182,1,186,1],[182,5,182,6],[182,33,182,52],[183,5,183,6],[183,33,183,52],[184,5,184,6],[184,33,184,52],[185,5,185,6],[185,33,185,52],[186,5,186,6],[186,33,186,52],[188,0,188,4],[188,5,188,6],[188,8,188,29],[189,0,189,4],[189,5,189,6],[189,8,189,29],[190,0,190,4],[190,5,190,6],[190,8,190,29],[191,0,191,29],[192,0,192,6],[192,8,192,29]]}
[{"$f":"+'Result AAP'!B1","v":" "},{"$nulls":29},"PRADEEP MODI",{"$nulls":3},"AAP Version B  : 20220316",123456,{"$nulls":6},{"$f":"IF(LEFT($AJ$1,1)=\"\",0,INT(LEFT($AJ$1,1)))","v":1},{"$f":"IF(MID($AJ$1,5,1)=\"\",0,INT(MID($AJ$1,5,1)))","v":5},{"$f":"IF(SUM(AT1:AZ4)<>600,0,21)","v":21},{"$f":"IF(COUNTIF($AQ$1:$AR$4,\"=1\")=1,100,0)","v":100},{"$nulls":5},{"$f":"IF(COUNTIF($AQ$1:$AR$4,\"=5\")=1,100,0)","v":100},{"$nulls":3},"Scoring Rules"]
[{"$f":"+'Result AAP'!B2","v":"Assessment Matrix for Annual Auditing Programe : 2021 Report"},{"$nulls":29},9413307717,{"$nulls":11},{"$f":"IF(MID($AJ$1,2,1)=\"\",0,INT(MID($AJ$1,2,1)))","v":2},{"$f":"IF(RIGHT($AJ$1,1)=\"\",0,INT(RIGHT($AJ$1,1)))","v":6},null,{"$f":"IF(COUNTIF($AQ$1:$AR$4,\"=2\")=1,100,0)","v":100},{"$nulls":5},{"$f":"IF(COUNTIF($AQ$1:$AR$4,\"=6\")=1,100,0)","v":100},{"$nulls":25},"Assessment Matrix for Annual Auditing Programme (Revised) - For Private Colleges"]
[{"$f":"+'Result AAP'!B3","v":"Inspection Phase : (Draft) for Session :  and Inspection Dates : -- and --"},{"$nulls":29},"pradeepjimodi@gmail.com",{"$nulls":11},{"$f":"IF(MID($AJ$1,3,1)=\"\",0,INT(MID($AJ$1,3,1)))","v":3},null,null,{"$f":"IF(COUNTIF($AQ$1:$AR$4,\"=3\")=1,100,0)","v":100}]
["Detailed Report",{"$nulls":41},{"$f":"IF(MID($AJ$1,4,1)=\"\",0,INT(MID($AJ$1,4,1)))","v":4},null,null,{"$f":"IF(COUNTIF($AQ$1:$AR$4,\"=4\")=1,100,0)","v":100},{"$nulls":31},"Detailed Rules for Scoring Credits with Weightage"]
["Crtieria","Key Indicators","SN","S. No. old","Parameters","Input Values",null,"Percentage or Ratio points","Credits","Weights","Weighted Credits",0,1,2,3,4,"Credits",{"$nulls":10},"Supporting Documents Seq. Number",null,null,"Proof Available ?","Team Verification",null,"Supporting Documents/Proofs",{"$nulls":19},"Error Message",null,"Credits"]
[{"$nulls":16},0,null,1,null,2,null,3,null,4,{"$nulls":30},0,1,2,3,4,{"$nulls":6},{"$f":"SUM(BO7:BO187)","v":716},100,400,0,93,0,372,93,0,372]
{"$rows_left_out":188}
{"sheet":"Result KeyFactorwise","index":4,"n_rows":24,"n_cols":8,"rows_kept":24,"merged":[[0,0,0,5],[1,0,1,5],[2,0,2,5],[4,0,8,0],[9,0,10,0],[11,0,12,0],[13,0,14,0],[15,0,16,0],[17,0,21,0]]}
[{"$f":"+Result!B1","v":" "}]
[{"$f":"+Input!A2","v":"Assessment Matrix for Annual Auditing Programe : 2021 Report"}]
[{"$f":"+Result!B3","v":"Inspection Phase : (Draft) for Session :  and Inspection Dates : -- and --"}]
["Crteria","Key Factors Criteria","Maximum Weighted Credits Possible","Actual Weighted Credits","Maximum Weighted Credits","Percentage of Actual with Maximum",null,"Delete Input Values Key Factor "]
["A. Teaching  and  Learning","A-1 Student Strength",{"$f":"+E5","v":{"v":14,"d":"14.00"}},{"$f":"+'Result KeyFactorwise AAP'!D5","v":{"v":0,"d":"0.00"}},{"$f":"+'Result KeyFactorwise AAP'!E5","v":{"v":14,"d":"14.00"}},{"$f":"IF(D5=0,\"\",ROUND(D5/C5*100,2))","v":""}]
[null,"A-2 Inclusivity",{"$f":"+E6","v":{"v":13,"d":"13.00"}},{"$f":"+'Result KeyFactorwise AAP'!D6","v":{"v":0,"d":"0.00"}},{"$f":"+'Result KeyFactorwise AAP'!E6","v":{"v":13,"d":"13.00"}},""]
{"$rows_left_out":19}
{"sheet":"Result","index":5,"n_rows":12,"n_cols":10,"rows_kept":12,"merged":[[0,1,0,5],[1,1,1,5],[2,1,2,5]]}
[null,{"$f":"+'Result AAP'!B1:G1","v":" "}]
[null,{"$f":"+Input!A2","v":"Assessment Matrix for Annual Auditing Programe : 2021 Report"}]
[null,{"$f":"+Input!A3","v":"Inspection Phase : (Draft) for Session :  and Inspection Dates : -- and --"}]
[null,"Performance Criteria","Maximum Weighted Credits Possible","Actual Weighted Credits","Maximum Weighted Credits","Percentage of Actual with Maximum",{"$nulls":3},"Delete Input Values Performance Criteria"]
[null,{"$f":"+Input!A7","v":"A. Teaching and Learning"},{"$f":"+E5","v":{"v":125,"d":"125.00"}},{"$f":"+'Result AAP'!D5","v":{"v":0,"d":"0.00"}},{"$f":"+'Result AAP'!E5","v":{"v":125,"d":"125.00"}},{"$f":"IF(D5=\"\",\"\",ROUND(D5/C5*100,2))","v":{"v":0,"d":"0.000"}},{"$nulls":3},"A"]
[null,{"$f":"+Input!A49","v":"B. Research and Professional Practices"},{"$f":"+E6","v":{"v":74,"d":"74.00"}},{"$f":"+'Result AAP'!D6","v":{"v":0,"d":"0.00"}},{"$f":"+'Result AAP'!E6","v":{"v":74,"d":"74.00"}},{"v":0,"d":"0.000"},{"$nulls":3},"B"]
{"$rows_left_out":7}
{"sheet":"Scoring Rules","index":6,"n_rows":193,"n_cols":78,"rows_kept":193,"merged":[[0,0,0,29],[0,30,0,33],[0,34,1,34],[0,35,3,35],[0,55,3,59],[1,0,1,29],[1,30,1,33],[2,0,2,29],[2,30,3,33],[2,34,3,34],[3,0,3,29],[4,0,5,0],[4,1,5,1],[4,2,5,2],[4,3,5,3],[4,4,5,4],[4,5,5,6],[4,7,5,7],[4,8,5,8],[4,9,5,9],[4,10,5,10],[4,11,5,11],[4,12,5,12],[4,13,5,13],[4,14,5,14],[4,15,5,15],[4,16,4,25],[4,27,5,29],[4,30,5,30],[4,31,5,31],[4,32,5,32],[4,33,5,52],[4,53,5,53],[4,55,4,59],[5,16,5,17],[5,18,5,19],[5,20,5,21],[5,22,5,23],[5,24,5,25],[6,0,16,0],[6,1,7,1],[6,33,6,52],[7,33,7,52],[8,1,16,1],[8,2,9,2],[8,3,9,3],[8,9,9,9],[8,33,8,52],[9,5,9,6],[9,33,9,52],[10,33,10,52],[11,33,11,52],[12,33,12,52],[13,33,13,52],[14,33,14,52],[15,33,15,52],[16,33,16,52],[17,0,25,0],[17,1,18,1],[17,33,17,52],[18,33,18,52],[19,1,25,1],[19,5,19,6],[19,33,19,52],[20,5,20,6],[20,33,20,52],[21,5,21,6],[21,33,21,52],[22,5,22,6],[22,33,22,52],[23,33,23,52],[24,33,24,52],[25,5,25,6],[25,33,25,51],[26,0,34,0],[26,1,32,1],[26,5,26,6],[26,33,26,51],[27,33,27,51],[28,33,28,51],[29,33,29,51],[30,5,30,6],[30,33,30,51],[31,5,31,6],[31,33,31,51],[32,5,32,6],[32,33,32,51],[33,1,34,1],[33,33,33,52],[34,33,34,52],[35,0,43,0],[35,1,43,1],[35,33,35,52],[36,33,36,52],[37,33,37,52],[38,33,38,52],[39,33,39,52],[40,33,40,52],[41,33,41,52],[42,33,42,51],[43,33,43,51],[44,0,47,0],[44,1,47,1],[44,33,44,52],[45,33,45,52],[46,33,46,52],[47,5,47,6],[47,33,47,52],[48,0,51,0],[48,1,51,1],[48,33,48,52],[49,33,49,52],[50,33,50,52],[51,33,51,52],[52,0,56,0],[52,1,56,1],[52,33,52,52],[53,33,53,52],[54,5,54,6],[54,33,54,52],[55,5,55,6],[55,33,55,52],[56,5,56,6],[56,33,56,52],[57,0,63,0],[57,33,57,52],[58,5,58,6],[58,33,58,52],[59,1,63,1],[59,33,59,52],[60,33,60,52],[61,5,61,6],[61,33,61,52],[62,5,62,6],[62,33,62,51],[63,5,63,6],[63,33,63,51],[64,0,73,0],[64,1,73,1],[64,5,64,6],[64,33,64,52],[65,33,65,52],[66,33,66,52],[67,33,67,52],[68,33,68,52],[69,33,69,52],[70,33,70,52],[71,33,71,52],[72,5,72,6],[72,33,72,52],[73,5,73,6],[73,33,73,52],[74,0,83,0],[74,1,83,1],[74,5,74,6],[74,33,74,52],[75,5,75,6],[75,33,75,52],[76,33,76,52],[77,5,77,6],[77,33,77,52],[78,33,78,52],[79,5,79,6],[79,33,79,52],[80,5,80,6],[80,33,80,52],[81,5,81,6],[81,33,81,52],[82,5,82,6],[82,33,82,52],[83,5,83,6],[83,33,83,52],[84,0,92,0],[84,1,88,1],[84,33,84,52],[85,5,85,6],[85,33,85,52],[86,5,86,6],[86,33,86,52],[87,5,87,6],[87,33,87,52],[88,5,88,6],[88,33,88,52],[89,1,92,1],[89,33,89,52],[90,33,90,52],[91,5,91,6],[91,33,91,52],[92,5,92,6],[92,33,92,52],[93,0,103,0],[93,1,103,1],[93,5,93,6],[93,33,93,52],[94,5,94,6],[94,33,94,52],[95,5,95,6],[95,33,95,52],[96,33,96,52],[97,33,97,52],[98,5,98,6],[98,33,98,52],[99,33,99,52],[100,5,100,6],[100,33,100,52],[101,5,101,6],[101,33,101,52],[102,33,102,52],[103,5,103,6],[103,33,103,52],[104,0,112,0],[104,1,112,1],[104,33,104,52],[105,5,105,6],[105,33,105,52],[106,5,106,6],[106,33,106,52],[107,5,107,6],[107,33,107,52],[108,5,108,6],[108,33,108,52],[109,5,109,6],[109,33,109,52],[110,5,110,6],[110,33,110,52],[111,5,111,6],[111,33,111,52],[112,5,112,6],[112,33,112,52],[113,0,121,0],[113,1,121,1],[113,5,113,6],[113,33,113,52],[114,5,114,6],[114,33,114,52],[115,5,115,6],[115,33,115,52],[116,5,116,6],[116,33,116,52],[117,5,117,6],[117,33,117,52],[118,5,118,6],[118,33,118,52],[119,5,119,6],[119,33,119,52],[120,5,120,6],[120,33,120,52],[121,5,121,6],[121,33,121,52],[122,0,131,0],[122,1,131,1],[122,5,122,6],[122,33,122,52],[123,5,123,6],[123,33,123,52],[124,5,124,6],[124,33,124,52],[125,5,125,6],[125,33,125,52],[126,5,126,6],[126,33,126,52],[127,5,127,6],[127,33,127,52],[128,5,128,6],[128,33,128,52],[129,5,129,6],[129,33,129,52],[130,5,130,6],[130,33,130,52],[131,5,131,6],[131,33,131,52],[132,0,140,0],[132,1,135,1],[132,33,132,52],[133,33,133,52],[134,33,134,52],[135,5,135,6],[135,33,135,52],[136,1,140,1],[136,5,136,6],[136,33,136,52],[137,5,137,6],[137,33,137,52],[138,5,138,6],[138,33,138,52],[139,5,139,6],[139,33,139,52],[140,5,140,6],[140,33,140,52],[141,0,148,0],[141,1,144,1],[141,5,141,6],[141,33,141,52],[142,5,142,6],[142,33,142,52],[143,5,143,6],[143,33,143,52],[144,5,144,6],[144,33,144,51],[145,1,148,1],[145,5,145,6],[145,33,145,52],[146,5,146,6],[146,33,146,52],[147,5,147,6],[147,33,147,52],[148,5,148,6],[148,33,148,52],[149,0,155,0],[149,1,151,1],[149,5,149,6],[149,33,149,52],[150,5,150,6],[150,33,150,52],[151,33,151,52],[152,1,155,1],[152,5,152,6],[152,33,152,52],[153,5,153,6],[153,33,153,52],[154,33,154,52],[155,5,155,6],[155,33,155,52],[156,0,164,0],[156,5,156,6],[156,33,156,52],[157,1,163,1],[157,5,157,6],[157,33,157,52],[158,5,158,6],[158,33,158,52],[159,5,159,6],[159,33,159,52],[160,5,160,6],[160,33,160,52],[161,5,161,6],[161,33,161,52],[162,5,162,6],[162,33,162,52],[163,5,163,6],[163,33,163,52],[164,5,164,6],[164,33,164,52],[165,0,171,0],[165,1,171,1],[165,2,166,2],[165,3,166,3],[165,5,166,6],[165,7,166,7],[165,8,166,8],[165,9,166,9],[165,10,166,10],[165,11,166,11],[165,12,166,12],[165,13,166,13],[165,14,166,14],[165,15,166,15],[165,16,166,16],[165,17,166,17],[165,18,166,18],[165,19,166,19],[165,20,166,20],[165,21,166,21],[165,22,166,22],[165,23,166,23],[165,24,166,24],[165,25,166,25],[165,26,166,26],[165,27,166,27],[165,28,166,28],[165,29,166,29],[165,30,166,30],[165,31,166,31],[165,32,166,32],[165,33,166,52],[165,53,166,53],[165,55,166,55],[165,56,166,56],[165,57,166,57],[165,58,166,58],[165,59,166,59],[165,64,166,64],[165,66,166,66],[165,67,166,67],[165,68,166,68],[165,69,166,69],[167,2,168,2],[167,3,168,3],[167,5,168,6],[167,7,168,7],[167,8,168,8],[167,9,168,9],[167,10,168,10],[167,11,168,11],[167,12,168,12],[167,13,168,13],[167,14,168,14],[167,15,168,15],[167,16,168,16],[167,17,168,17],[167,18,168,18],[167,19,168,19],[167,20,168,20],[167,21,168,21],[167,22,168,22],[167,23,168,23],[167,24,168,24],[167,25,168,25],[167,26,168,26],[167,27,168,27],[167,28,168,28],[167,29,168,29],[167,30,168,30],[167,31,168,31],[167,32,168,32],[167,33,168,52],[167,53,168,53],[167,55,168,55],[167,56,168,56],[167,57,168,57],[167,58,168,58],[167,59,168,59],[167,64,168,64],[167,66,168,66],[167,67,168,67],[167,68,168,68],[167,69,168,69],[169,5,169,6],[169,33,169,52],[170,5,170,6],[170,33,170,52],[171,5,171,6],[171,33,171,52],[172,0,181,0],[172,1,181,1],[172,5,172,6],[172,33,172,52],[173,33,173,52],[174,5,174,6],[174,33,174,52],[175,5,175,6],[175,33,175,52],[176,5,176,6],[176,33,176,52],[177,33,177,52],[178,5,178,6],[178,33,178,52],[179,33,179,52],[180,5,180,6],[180,33,180,52],[181,5,181,6],[181,33,181,52],[182,0,186,0],[182,1,186,1],[182,5,182,6],[182,33,182,52],[183,5,183,6],[183,33,183,52],[184,5,184,6],[184,33,184,52],[185,5,185,6],[185,33,185,52],[186,5,186,6],[186,33,186,52],[188,0,188,4],[188,5,188,6],[188,8,188,29],[189,0,189,4],[189,5,189,6],[189,8,189,29],[190,0,190,4],[190,5,190,6],[190,8,190,29],[191,0,191,29],[192,0,192,6],[192,8,192,29]]}
[{"$nulls":30},"PRADEEP MODI",{"$nulls":3},"AAP Version B  : 20220313",123456,{"$nulls":6},{"$f":"IF(LEFT($AJ$1,1)=\"\",0,INT(LEFT($AJ$1,1)))","v":1},{"$f":"IF(MID($AJ$1,5,1)=\"\",0,INT(MID($AJ$1,5,1)))","v":5},{"$f":"IF(SUM(AT1:AZ4)<>600,0,21)","v":21},{"$f":"IF(COUNTIF($AQ$1:$AR$4,\"=1\")=1,100,0)","v":100},{"$nulls":5},{"$f":"IF(COUNTIF($AQ$1:$AR$4,\"=5\")=1,100,0)","v":100},{"$nulls":3},"Scoring Rules"]
["Assessment Matrix for Annual Auditing Programme (Revised) - For Private Colleges",{"$nulls":29},9413307717,{"$nulls":11},{"$f":"IF(MID($AJ$1,2,1)=\"\",0,INT(MID($AJ$1,2,1)))","v":2},{"$f":"IF(RIGHT($AJ$1,1)=\"\",0,INT(RIGHT($AJ$1,1)))","v":6},null,{"$f":"IF(COUNTIF($AQ$1:$AR$4,\"=2\")=1,100,0)","v":100},{"$nulls":5},{"$f":"IF(COUNTIF($AQ$1:$AR$4,\"=6\")=1,100,0)","v":100},{"$nulls":25},"Assessment Matrix for Annual Auditing Programme (Revised) - For Private Colleges"]
[{"$nulls":30},"pradeepjimodi@gmail.com",{"$nulls":11},{"$f":"IF(MID($AJ$1,3,1)=\"\",0,INT(MID($AJ$1,3,1)))","v":3},null,null,{"$f":"IF(COUNTIF($AQ$1:$AR$4,\"=3\")=1,100,0)","v":100}]
["Detailed Rules for Scoring Credits with Weightage",{"$nulls":41},{"$f":"IF(MID($AJ$1,4,1)=\"\",0,INT(MID($AJ$1,4,1)))","v":4},null,null,{"$f":"IF(COUNTIF($AQ$1:$AR$4,\"=4\")=1,100,0)","v":100},{"$nulls":31},"Detailed Rules for Scoring Credits with Weightage"]
["Crtieria","Key Indicators","SN","S. No. old","Parameters","Input Values",null,"Percentage or Ratio points","Credits","Weights","Weighted Credits",0,1,2,3,4,"Credits",{"$nulls":10},"Supporting Documents Seq. Number",null,null,"Proof Available ?","Team Verification",null,"Supporting Documents/Proofs",{"$nulls":19},"Error Message",null,"Credits"]
[{"$nulls":16},0,null,1,null,2,null,3,null,4,{"$nulls":30},0,1,2,3,4,{"$nulls":6},{"$f":"SUM(BO7:BO187)","v":716},100.25,401,0,93.25,0,373,93.25,0,373]
{"$rows_left_out":187}